{"text_format":"1","workbook":"xlsx","n_sheets":16,"sheets":["Header","Quote History","Bridge Quote","Bridge Heads of Terms","BR Drop Downs","BR Workings","BR Matrix","BTL Quote","BTL Heads of Terms","BTL Drop Downs","BTL Workings","BTL Matrix","Marketing Words","BR Quote History","BTL Quote History","ONS"],"not_rendered":{"charts":0,"images":2,"macros":1,"external_links":0,"defined_names":2,"comments":2,"pivot_tables":0},"unopened":[],"bounds":{"document_bytes":16777216,"sheet_cells":100000,"rows_first":2000,"rows_last":500,"rows_between":2000,"halvings":0,"cell_chars":16384,"cell_head_chars":4096},"cells_cut":0,"cells_raw":0,"read":"whole","date_system":"1900"}

{"sheet":"Header","index":0,"n_rows":31,"n_cols":18,"rows_kept":31,"cut":false,"hidden":false,"merged":[[11,2,11,5],[29,2,29,7],[30,2,30,7],[27,2,27,7],[23,2,23,5],[6,2,6,7],[7,2,7,5],[8,2,8,5],[9,2,9,5],[10,2,10,5],[12,10,21,10],[28,2,28,7],[12,2,12,5],[13,2,13,5],[14,2,14,5],[15,2,15,5],[16,2,16,5],[17,2,17,5],[18,2,18,5],[19,2,19,5],[20,2,20,5],[21,2,21,5],[22,2,22,5]]}
[]
[]
[]
[]
[null,null,null,null,null,null,null,null,null,null,null,null,null,null,null,null,null,{"$f":"RANDBETWEEN(1,R6)","v":12}]
[null,null,null,null,null,null,null,null,null,null,null,null,null,null,null,null,null,{"$f":"MAX('Marketing Words'!B6:B102)","v":17}]
[null,null,"Term Loans"]
[null,null," Quick and straightforward First and Second Charge Term Loans",null,null,null,null,"a"]
{"$rows_left_out":24}
{"sheet":"Quote History","index":1,"n_rows":33,"n_cols":13,"rows_kept":33,"cut":false,"hidden":false,"merged":[]}
[]
[]
[]
[null,null,"Term Loan Quote History",null,null,null,null,null,null,null,null,null,{"$f":"'BTL Workings'!C3","v":"B"}]
[null,null,"Retrieve Quote:",null,null,null,null,"Delete Quote:",null,null,null,null,{"$f":"IF(J5>MAX(B8:B17),\"Error\",J5+5)","v":5}]
[null,{"$f":"'BTL Quote History'!C4","v":"ERROR"},2,2,6,5,7,14,59,58]
[null,"No","Date","Time","Name","Plan","Security Property","Net Loan","Payment","Rate"]
[null,{"$f":"IF('BTL Quote History'!C1=0,\"\",'BTL Quote History'!C1)","v":""},{"$f":"IF($B8=\"\",\"\",HLOOKUP($B8,'BTL Quote History'!$2:$62,C$6,FALSE))","v":""},{"$f":"IF($B8=\"\",\"\",HLOOKUP($B8,'BTL Quote History'!$2:$62,D$6,FALSE))","v":""},{"$f":"IF($B8=\"\",\"\",HLOOKUP($B8,'BTL Quote History'!$2:$62,E$6,FALSE))","v":""},{"$f":"IF($B8=\"\",\"\",HLOOKUP($B8,'BTL Quote History'!$2:$62,F$6,FALSE))","v":""},{"$f":"IF($B8=\"\",\"\",HLOOKUP($B8,'BTL Quote History'!$2:$62,G$6,FALSE))","v":""},{"$f":"IF($B8=\"\",\"\",HLOOKUP($B8,'BTL Quote History'!$2:$62,H$6,FALSE))","v":""},{"$f":"IF($B8=\"\",\"\",HLOOKUP($B8,'BTL Quote History'!$2:$62,I$6,FALSE))","v":""},{"$f":"IF($B8=\"\",\"\",HLOOKUP($B8,'BTL Quote History'!$2:$62,J$6,FALSE))","v":""}]
{"$rows_left_out":26}
{"sheet":"Bridge Quote","index":2,"n_rows":45,"n_cols":17,"rows_kept":45,"cut":false,"hidden":false,"merged":[[2,2,3,2],[2,12,3,12],[4,2,5,2],[4,12,5,12],[33,4,34,5],[16,4,19,5],[11,12,12,12],[13,12,14,12],[18,7,18,8],[17,7,17,8],[21,7,21,8],[22,7,22,8],[23,7,23,8],[24,7,24,8],[16,7,16,8],[27,7,27,8],[43,7,43,8],[33,10,33,11],[34,10,34,11],[35,10,35,11],[36,10,36,11],[39,7,39,8],[40,7,40,8],[33,7,33,8],[34,7,34,8],[2,14,3,14],[4,14,5,14],[25,7,25,8],[41,7,41,8],[42,7,42,8],[19,7,19,8],[20,7,20,8],[29,7,29,8],[30,7,30,8],[31,7,31,8],[1,7,3,7],[32,7,32,8],[28,7,28,8]]}
[null,null,null,null,null,null,null,null,null,null,null,null,null,"Broker / Direct",{"$f":"'BR Workings'!C3","v":"B"}]
[null,"Applicant Details",null,null,"Loan Outputs",null,null,"Bridge Calculator",null,null,"Affordability - Household Size",null,null,"Completed","Inputs","Hist row","Afford inputs"]
[null,"Applicant Name","<Complete>",{"$f":"IF(OR(C3=\"\",C3=\"<Select>\",C3=\"<Complete>\"),1,0)","v":1},"Net Loan",{"$f":"IF('BR Workings'!$C$10=\"N\",\"\",'BR Workings'!F39)","v":""},null,null,null,null,"Number of Adults","<Select>","Add the relevant number of Adults/Dependants living in the property.",{"$f":"IF(OR(L3=\"\",L3=\"<Select>\",L3=\"<Complete>\"),1,0)","v":1},{"$f":"IF(INDIRECT(\"'br Quote History'!C\"&P3)=\"\",\"\",INDIRECT(\"'br Quote History'!C\"&P3))","v":"<Complete>"},7,{"$f":"IF('BR Quote History'!C37=\"\",0,'BR Quote History'!C37)","v":"<Select>"}]
[null,null,{"$error":"#REF!"},null,{"$f":"\"Lender Fee\"&IF(C42=TRUE,\" (up front)\",\"\")","v":"Lender Fee"},{"$f":"IF('BR Workings'!$C$10=\"N\",\"\",C19)","v":""},null,null,null,null,"Number of Dependants","<Select>",null,{"$f":"IF(OR(L4=\"\",L4=\"<Select>\",L4=\"<Complete>\"),1,0)","v":1},{"$f":"IF(INDIRECT(\"'BTL Quote History'!C\"&P4)=\"\",0,INDIRECT(\"'BTL Quote History'!C\"&P4))","v":{"$error":"#REF!"}},null,{"$f":"IF('BR Quote History'!C38=\"\",0,'BR Quote History'!C38)","v":"<Select>"}]
[null,"Security Address","<Complete>",{"$f":"IF(OR(C5=\"\",C5=\"<Select>\",C5=\"<Complete>\"),1,0)","v":1},{"$f":"\"Title Insurance\"&IF(C42=TRUE,\" (up front)\",\"\")","v":"Title Insurance"},{"$f":"IF('BR Workings'!$C$10=\"N\",\"\",'BR Workings'!F42)","v":""},null,null,null,1,{"$f":"IF($N$4=1,\"\",IF(J5<=$L$4,\"Dependant \"&J5&\" - age\",\"\"))","v":""},"<Select>","Any dependants aged over 18 should be classed as an adults.",1,{"$f":"IF(INDIRECT(\"'br Quote History'!C\"&P5)=\"\",\"\",INDIRECT(\"'br Quote History'!C\"&P5))","v":"<Complete>"},8,{"$f":"IF('BR Quote History'!C39=\"\",0,'BR Quote History'!C39)","v":"<Select>"}]
[null,null,{"$error":"#REF!"},null,{"$f":"\"Broker Fee\"&IF(C41=TRUE,\" (up front)\",\"\")","v":"Broker Fee"},{"$f":"IF('BR Workings'!$C$10=\"N\",\"\",'BR Workings'!F40)","v":""},null,null,null,2,{"$f":"IF($N$4=1,\"\",IF(J6<=$L$4,\"Dependant \"&J6&\" - age\",\"\"))","v":""},"<Select>",null,1,{"$f":"IF(INDIRECT(\"'BTL Quote History'!C\"&P6)=\"\",0,INDIRECT(\"'BTL Quote History'!C\"&P6))","v":{"$error":"#REF!"}},null,{"$f":"IF('BR Quote History'!C40=\"\",0,'BR Quote History'!C40)","v":"<Select>"}]
[null,"Is Borrower a Ltd Co?","<Select>",{"$f":"IF(OR(C7=\"\",C7=\"<Select>\",C7=\"<Complete>\"),1,0)","v":1},null,null,null,null,null,3,"","<Select>",null,1,{"$f":"IF(INDIRECT(\"'br Quote History'!C\"&P7)=\"\",\"\",INDIRECT(\"'br Quote History'!C\"&P7))","v":"<Select>"},35,{"$f":"IF('BR Quote History'!C41=\"\",0,'BR Quote History'!C41)","v":"<Select>"}]
[null,null,null,null,"Gross Loan",{"$f":"IF('BR Workings'!$C$10=\"N\",\"\",'BR Workings'!F43)","v":""},null,null,null,4,"","<Select>",null,1,null,null,{"$f":"IF('BR Quote History'!C42=\"\",0,'BR Quote History'!C42)","v":"<Select>"}]
{"$rows_left_out":38}
{"sheet":"Bridge Heads of Terms","index":3,"n_rows":93,"n_cols":7,"rows_kept":93,"cut":false,"hidden":false,"merged":[[16,1,17,1],[16,2,17,2],[7,1,7,2],[9,1,9,2],[12,1,12,2],[13,1,14,1],[13,2,14,2],[61,1,61,2],[19,1,19,2],[32,1,32,2],[53,1,53,2],[55,1,55,2],[56,1,56,2],[57,1,57,2],[58,1,58,2],[59,1,59,2],[60,1,60,2],[75,1,75,2],[62,1,62,2],[63,1,63,2],[64,1,64,2],[65,1,65,2],[67,1,67,2],[69,1,69,2],[70,1,70,2],[71,1,71,2],[72,1,72,2],[73,1,73,2],[74,1,74,2],[66,1,66,2],[68,1,68,2],[87,1,87,2],[76,1,76,2],[77,1,77,2],[78,1,78,2],[79,1,79,2],[80,1,80,2],[81,1,81,2],[82,1,82,2],[83,1,83,2],[84,1,84,2],[85,1,85,2],[86,1,86,2],[88,1,88,2],[89,1,89,2],[90,1,90,2],[91,1,91,2],[92,1,92,2]]}
[]
[]
[null,{"$f":"\"Date: \"","v":"Date: "}]
[null,{"$f":"INDIRECT(\"'BR Quote History'!e3\")","v":"00:00:00"}]
[]
[null,"Introducer Name:"]
[]
[null,"Heads of Terms"]
{"$rows_left_out":86}
{"sheet":"BR Drop Downs","index":4,"n_rows":21,"n_cols":17,"rows_kept":21,"cut":false,"hidden":true,"merged":[]}
["Highlighted are lookups from dropdowns"]
[null,"Purpose","Security Type","Status","Plan status","Product Type","Charge","Rate Type","Fix Term(m)","Fix Code","Service Type","Repayment","1st Rate Type","Y/N","Dependants","Dependant Age","Term"]
[null,"<Select>","<Select>","<Select>",null,"<Select>",null,"<Select>",null,null,"<Select>","<Select>","<Select>","<Select>","<Select>","<Select>","<Select>"]
[null,"Purchase","BTL","0 Status",0,"Second Charge",2,"Variable",0,"V","Rolled","I/Only","Variable","Yes",0,0,1]
[null,"Refurbishment","HMO","1 Status",1,"Equitable Charge",2,"Fixed for Term",18,"FFT","Serviced","Repayment","Fixed < 5Yr","No",1,1,2]
[null,"Consolidation","Holiday Let","2 Status",2,{"$f":"IF('BR Workings'!C16=\"Y\",\"\",\"First Charge Purchase\")","v":"First Charge Purchase"},1,null,null,null,null,null,"Fixed => 5Yr",null,2,2,3]
[null,"Business","Student Let",null,null,{"$f":"IF('BR Workings'!C16=\"Y\",\"\",\"First Charge Refinance\")","v":"First Charge Refinance"},1,null,null,null,null,null,null,null,3,3,4]
[null,"Lease extension","MUFB",null,null,{"$f":"IF('BR Workings'!C16=\"Y\",\"\",\"First Charge Unencumbered\")","v":"First Charge Unencumbered"},1,null,null,null,null,null,null,null,4,4,5]
{"$rows_left_out":14}
{"sheet":"BR Workings","index":5,"n_rows":194,"n_cols":19,"rows_kept":194,"cut":false,"hidden":true,"merged":[[187,8,188,8],[189,8,190,8],[187,10,188,11],[189,10,190,11],[187,13,188,13],[189,13,190,13],[58,5,60,5],[187,2,188,3],[189,2,190,3],[191,2,192,3],[193,2,194,3],[187,5,188,6],[189,5,190,6]]}
[]
[null,"Inputs",null,null,null,null,"Publishing Calculator"]
[null,"Broker / Direct","B"]
[null,"Location",{"$f":"LEFT('Bridge Quote'!C24)","v":"<"}]
[null,"Purchase",{"$f":"IF(ISERROR(FIND(\"Purchase\",'Bridge Quote'!C11)),\"N\",\"Y\")","v":"N"}]
[null,"Charge",{"$f":"IFERROR(VLOOKUP('Bridge Quote'!C11,'BR Drop Downs'!F4:G10,2,FALSE),1)","v":1}]
[null,"Status",{"$f":"VLOOKUP('Bridge Quote'!C13,'BR Drop Downs'!D4:E10,2,FALSE)","v":{"$error":"#N/A"}},null,null,null,null,null,null,"After publishing non-macro ensure you save-as type"]
[null,"Repayment basis",{"$f":"LEFT('Bridge Quote'!C12)","v":"<"},null,null,null,null,null,null,"Excel workbook (NOT macro-enabled)"]
{"$rows_left_out":187}
{"sheet":"BR Matrix","index":6,"n_rows":23,"n_cols":9,"rows_kept":23,"cut":false,"hidden":false,"merged":[[2,2,2,4],[2,5,2,7],[9,1,9,7],[18,1,18,7]]}
[]
[null,"Bridge Product Matrix"]
[null,"Security","1st charge",null,null,"2nd charge"]
[null,"Charge",1,1,1,2,2,2]
[null,"Status",0,1,2,0,1,2]
[null,"Plan code (charge-status)",{"$f":"C4&\"-\"&C5","v":"1-0"},{"$f":"D4&\"-\"&D5","v":"1-1"},"1-2","2-0","2-1","2-2"]
[null,"Max LTV",0.75,0.75,0.7,0.75,0.75,0.7]
[null,"Min Net",25000,25000,25000,25000,25000,25000]
{"$rows_left_out":16}
{"sheet":"BTL Quote","index":7,"n_rows":45,"n_cols":17,"rows_kept":45,"cut":false,"hidden":false,"merged":[[2,14,3,14],[4,14,5,14],[41,7,41,8],[42,7,42,8],[4,12,5,12],[11,12,12,12],[13,12,14,12],[2,12,3,12],[35,10,35,11],[36,10,36,11],[25,7,25,8],[29,7,29,8],[30,7,30,8],[31,7,31,8],[32,7,32,8],[1,7,3,7],[43,7,43,8],[20,7,20,8],[40,7,40,8],[21,7,21,8],[39,7,39,8],[34,7,34,8],[33,7,33,8],[4,2,5,2],[2,2,3,2],[33,10,33,11],[34,10,34,11],[17,7,17,8],[18,7,18,8],[19,7,19,8],[22,7,22,8],[23,7,23,8],[24,7,24,8],[28,7,28,8],[16,4,19,5],[33,4,34,5]]}
[null,null,null,null,null,null,null,null,null,null,null,null,null,"Broker / Direct",{"$f":"'BR Workings'!C3","v":"B"}]
[null,"Applicant Details",null,null,"Loan Outputs",null,null,"Term Loan Calculator",null,null,"Affordability - Household Size",null,null,"Completed","Inputs","Hist row","Afford inputs"]
[null,"Applicant Name","<Complete>",{"$f":"IF(OR(C3=\"\",C3=\"<Select>\",C3=\"<Complete>\"),1,0)","v":1},"Net Loan",{"$f":"IF('BTL Workings'!$C$10=\"N\",\"\",'BTL Workings'!F39)","v":""},null,null,null,null,"Number of Adults","<Select>","Add the relevant number of Adults/Dependants living in the property.",{"$f":"IF(OR(L3=\"\",L3=\"<Select>\",L3=\"<Complete>\"),1,0)","v":1},{"$f":"IF(INDIRECT(\"'BTL Quote History'!C\"&P3)=\"\",\"\",INDIRECT(\"'BTL Quote History'!C\"&P3))","v":"<Complete>"},7,{"$f":"IF('BTL Quote History'!C37=\"\",0,'BTL Quote History'!C37)","v":"<Select>"}]
[null,null,{"$error":"#REF!"},null,{"$f":"\"Lender Fee\"&IF(C42=TRUE,\" (up front)\",\"\")","v":"Lender Fee"},{"$f":"IF('BTL Workings'!$C$10=\"N\",\"\",C19)","v":""},null,null,null,null,"Number of Dependants","<Select>",null,{"$f":"IF(OR(L4=\"\",L4=\"<Select>\",L4=\"<Complete>\"),1,0)","v":1},{"$f":"IF(INDIRECT(\"'BTL Quote History'!C\"&P4)=\"\",0,INDIRECT(\"'BTL Quote History'!C\"&P4))","v":{"$error":"#REF!"}},null,{"$f":"IF('BTL Quote History'!C38=\"\",0,'BTL Quote History'!C38)","v":"<Select>"}]
[null,"Security Address","<Complete>",{"$f":"IF(OR(C5=\"\",C5=\"<Select>\",C5=\"<Complete>\"),1,0)","v":1},{"$f":"\"Title Insurance\"&IF(C42=TRUE,\" (up front)\",\"\")","v":"Title Insurance"},{"$f":"IF('BTL Workings'!$C$10=\"N\",\"\",'BTL Workings'!F42)","v":""},null,null,null,1,{"$f":"IF($N$4=1,\"\",IF(J5<=$L$4,\"Dependant \"&J5&\" - age\",\"\"))","v":""},"<Select>","Any dependants aged over 18 should be classed as an adults.",1,{"$f":"IF(INDIRECT(\"'BTL Quote History'!C\"&P5)=\"\",\"\",INDIRECT(\"'BTL Quote History'!C\"&P5))","v":"<Complete>"},8,{"$f":"IF('BTL Quote History'!C39=\"\",0,'BTL Quote History'!C39)","v":"<Select>"}]
[null,null,{"$error":"#REF!"},null,{"$f":"\"Broker Fee\"&IF(C41=TRUE,\" (up front)\",\"\")","v":"Broker Fee"},{"$f":"IF('BTL Workings'!$C$10=\"N\",\"\",'BTL Workings'!F40)","v":""},null,null,null,2,{"$f":"IF($N$4=1,\"\",IF(J6<=$L$4,\"Dependant \"&J6&\" - age\",\"\"))","v":""},"<Select>",null,1,{"$f":"IF(INDIRECT(\"'BTL Quote History'!C\"&P6)=\"\",0,INDIRECT(\"'BTL Quote History'!C\"&P6))","v":{"$error":"#REF!"}},null,{"$f":"IF('BTL Quote History'!C40=\"\",0,'BTL Quote History'!C40)","v":"<Select>"}]
[null,"Is Borrower a Ltd Co?","<Select>",{"$f":"IF(OR(C7=\"\",C7=\"<Select>\",C7=\"<Complete>\"),1,0)","v":1},null,null,null,null,null,3,"","<Select>",null,1,{"$f":"IF(INDIRECT(\"'BTL Quote History'!C\"&P7)=\"\",\"\",INDIRECT(\"'BTL Quote History'!C\"&P7))","v":"<Select>"},35,{"$f":"IF('BTL Quote History'!C41=\"\",0,'BTL Quote History'!C41)","v":"<Select>"}]
[null,null,null,null,"Gross Loan",{"$f":"IF('BTL Workings'!$C$10=\"N\",\"\",'BTL Workings'!F43)","v":""},null,null,null,4,"","<Select>",null,1,null,null,{"$f":"IF('BTL Quote History'!C42=\"\",0,'BTL Quote History'!C42)","v":"<Select>"}]
{"$rows_left_out":38}
{"sheet":"BTL Heads of Terms","index":8,"n_rows":93,"n_cols":7,"rows_kept":93,"cut":false,"hidden":false,"merged":[[88,1,88,2],[92,1,92,2],[89,1,89,2],[90,1,90,2],[91,1,91,2],[87,1,87,2],[81,1,81,2],[72,1,72,2],[73,1,73,2],[74,1,74,2],[75,1,75,2],[76,1,76,2],[77,1,77,2],[78,1,78,2],[82,1,82,2],[83,1,83,2],[84,1,84,2],[85,1,85,2],[86,1,86,2],[57,1,57,2],[58,1,58,2],[59,1,59,2],[79,1,79,2],[80,1,80,2],[63,1,63,2],[64,1,64,2],[65,1,65,2],[66,1,66,2],[68,1,68,2],[69,1,69,2],[70,1,70,2],[71,1,71,2],[60,1,60,2],[61,1,61,2],[62,1,62,2],[55,1,55,2],[56,1,56,2],[33,1,33,2],[7,1,7,2],[9,1,9,2],[53,1,53,2],[12,1,12,2],[13,1,14,1],[13,2,14,2],[16,1,17,1],[16,2,17,2],[19,1,19,2],[32,1,32,2]]}
[]
[]
[null,{"$f":"\"Date: \"","v":"Date: "}]
[null,{"$f":"INDIRECT(\"'BTL Quote History'!e3\")","v":"00:00:00"}]
[]
[null,"Introducer Name:"]
[]
[null,"Heads of Terms"]
{"$rows_left_out":86}
{"sheet":"BTL Drop Downs","index":9,"n_rows":23,"n_cols":16,"rows_kept":23,"cut":false,"hidden":true,"merged":[]}
["Highlighted are lookups from dropdowns"]
[null,"Purpose","Security Type","Status","Plan status","Product Type","Charge","Rate Type","Fix Term(m)","Fix Code","ERC","Repayment","1st Rate Type","Y/N","Dependants","Dependant Age"]
[null,"<Select>","<Select>","<Select>",null,"<Select>",null,"<Select>",null,null,null,"<Select>","<Select>","<Select>","<Select>","<Select>"]
[null,"Purchase","BTL","0 Status",0,"Second Charge",2,"Variable",0,"V","None","I/Only","Variable","Yes",0,0]
[null,"Refurbishment","HMO","1 Status",1,{"$f":"IF('BTL Workings'!C16=\"Y\",\"\",\"First Charge Purchase\")","v":"First Charge Purchase"},1,"2 Yr Fixed",24,2,"Year 1; 2%. Year 2; 1%","Repayment","Fixed < 5Yr","No",1,1]
[null,"Consolidation","Holiday Let","2 Status",2,{"$f":"IF('BTL Workings'!C16=\"Y\",\"\",\"First Charge Refinance\")","v":"First Charge Refinance"},1,"3 Yr Fixed",36,3,"Year 1; 3%. Year 2; 2%. Year 3; 1%",null,"Fixed => 5Yr",null,2,2]
[null,"Business","Student Let",null,null,{"$f":"IF('BTL Workings'!C16=\"Y\",\"\",\"First Charge Unencumbered\")","v":"First Charge Unencumbered"},1,"5 Yr Fixed",60,5,"Year 1 - 5%, Year 2 - 4%, Year 3 - 3%, Year 4 - 2%, Year 5 - 1%",null,null,null,3,3]
[null,"Lease extension","MUFB",null,null,null,null,"5 Yr Fixed (No ERC)",60,"5N","None",null,null,null,4,4]
{"$rows_left_out":16}
{"sheet":"BTL Workings","index":10,"n_rows":184,"n_cols":19,"rows_kept":184,"cut":false,"hidden":true,"merged":[[58,5,60,5]]}
[]
[null,"Inputs",null,null,null,null,"Publishing Calculator"]
[null,"Broker / Direct","B"]
[null,"Location",{"$f":"LEFT('BTL Quote'!C24)","v":"<"}]
[null,"Purchase",{"$f":"IF(ISERROR(FIND(\"Purchase\",'BTL Quote'!C11)),\"N\",\"Y\")","v":"N"}]
[null,"Charge",{"$f":"IFERROR(VLOOKUP('BTL Quote'!C11,'BTL Drop Downs'!F4:G11,2,FALSE),1)","v":1}]
[null,"Status",{"$f":"VLOOKUP('BTL Quote'!C13,'BTL Drop Downs'!D4:E10,2,FALSE)","v":{"$error":"#N/A"}},null,null,null,null,null,null,"After publishing non-macro ensure you save-as type"]
[null,"Repayment basis",{"$f":"LEFT('BTL Quote'!C12)","v":"<"},null,null,null,null,null,null,"Excel workbook (NOT macro-enabled)"]
{"$rows_left_out":177}
{"sheet":"BTL Matrix","index":11,"n_rows":23,"n_cols":9,"rows_kept":23,"cut":false,"hidden":false,"merged":[[2,2,2,4],[2,5,2,7],[9,1,9,7],[18,1,18,7]]}
[]
[null,"Term Loan Product Matrix"]
[null,"Security","1st charge",null,null,"2nd charge"]
[null,"Charge",1,1,1,2,2,2]
[null,"Status",0,1,2,0,1,2]
[null,"Plan code (charge-status)",{"$f":"C4&\"-\"&C5","v":"1-0"},{"$f":"D4&\"-\"&D5","v":"1-1"},"1-2","2-0","2-1","2-2"]
[null,"Max LTV",0.75,0.75,0.7,0.75,0.75,0.7]
[null,"Min Net",10000,10000,10000,10000,10000,10000]
{"$rows_left_out":16}
{"sheet":"Marketing Words","index":12,"n_rows":42,"n_cols":18,"rows_kept":42,"cut":false,"hidden":true,"merged":[]}
["Date",{"$f":"NOW()","v":"2026-04-02T11:14:23.640"},"Current Wordings",null,"Standard Wordings","Seasonal Wordings",1,{"$f":"G1+1","v":2},{"$f":"H1+1","v":3},4,5,6,7,8,9,10,11,12]
["Offset use",{"$f":"IFERROR(HLOOKUP(1,G4:R5,2,FALSE),E5)","v":0},null,null,null,"From Date","2026-02-25"]
[null,null,null,null,null,"To Date","2026-03-15"]
[null,null,null,null,null,"Applies ",{"$f":"IF(AND(G2<=$B$1,G3>=$B$1),1,0)","v":0},{"$f":"IF(AND(H2<=$B$1,H3>=$B$1),1,0)","v":0},0,0,0,0,0,0,0,0,0,0]
[null,null,null,"Offset",0,"Offset",2,{"$f":"G5+1","v":3},{"$f":"H5+1","v":4},5,6,7,8,9,10,11,12,13]
[null,1,{"$f":"IF(OFFSET(E6,0,$B$2)=\"\",\"\",OFFSET(E6,0,$B$2))","v":"Speedy lending for complex needs, with a personal touch"},null,"Speedy lending for complex needs, with a personal touch",null,"NEW - Now offering up to 75% LTV in Northern Ireland"]
[null,{"$f":"IF(C7=\"\",\"\",B6+1)","v":2},{"$f":"IF(OFFSET(E7,0,$B$2)=\"\",\"\",OFFSET(E7,0,$B$2))","v":"Each application is assessed by a member of our team—not a computer"},null,"Each application is assessed by a member of our team—not a computer",null,"NEW – Second charge loan size increased to 500k"]
[null,{"$f":"IF(C8=\"\",\"\",B7+1)","v":3},"Looking for a quick, straightforward, and flexible lending solution tailored to your customer's needs?",null,"Looking for a quick, straightforward, and flexible lending solution tailored to your customer's needs?",null,"NEW – Terms now available up to 360 months"]
{"$rows_left_out":35}
{"sheet":"BR Quote History","index":13,"n_rows":64,"n_cols":20,"rows_kept":64,"cut":false,"hidden":false,"merged":[]}
[null,{"$f":"A1-1","v":-1},{"$f":"MAX(C2:AK2)-1","v":0}]
[null,"Quote No","To retrieve",{"$f":"COUNTA(D9:$AP$9)","v":1},null,null,null,0,-1,-2,-3,-4,-5,-6,-7,-8,-5,-6,-7,-8]
[2,"Date"]
[{"$f":"A3+1","v":3},"Different Quote",{"$f":"+IF(SUM(C7:C51,C64)=0,\"ERROR\",\"OK\")","v":"ERROR"},{"$f":"IF('BR Workings'!$C$10=\"N\",\"N\",IF(D5<>E5,\"Y\",\"N\"))","v":"N"}]
[4,"Index",null,{"$f":"D9&\"-\"&D10&\"-\"&D11&\"-\"&D12&\"-\"&D13&\"-\"&D14&\"-\"&D15&\"-\"&D16&\"-\"&D17&\"-\"&D18&\"-\"&D19&\"-\"&D20&\"-\"&D21&\"-\"&D22&\"-\"&D23&\"-\"&D24&\"-\"&D25&\"-\"&D26&\"-\"&D27&\"-\"&D28&\"-\"&D29&\"-\"&D30&\"-\"&D31&\"-\"&D32&\"-\"&D33&\"-\"&D34&\"-\"&D35&\"-\"&D36&\"-\"&D37&\"-\"&D38&\"-\"&D39&\"-\"&D40&\"-\"&D41&\"-\"&D42&\"-\"&D43&\"-\"&D44&\"-\"&D45&\"-\"&D46&\"-\"&D47&\"-\"&D48&\"-\"&D49&\"-\"&D50&\"-\"&D51&D64","v":"<Select>-<Select>-<Select>-<Select>-<Select>-<Complete>-<Complete>-<Optional>-0-<Complete>-<Select>-<Select>-<Complete>-<Optional>-<Select>-<Select>-<Complete>-<Complete>-<Complete>-FALSE-FALSE-FALSE-FALSE-FALSE-FALSE-FALSE-<Select>-<Complete>-<Select>-<Select>-<Select>-<Select>-<Select>-<Select>-<Select>-<Complete>-<Optional>-<Complete>-<Complete>-<Complete>-<Optional>-<Optional>-<Optional>FALSE"}]
[5,"Short Plan",null,{"$f":"D9&\"-\"&D10&\"-\"&D11&\"-\"&D12&\"-\"&D13","v":"<Select>-<Select>-<Select>-<Select>-<Select>"}]
[6,"Applicant Name",{"$f":"OFFSET(C7,0,'Quote History'!$E$21+1)","v":"<Complete>"},{"$f":"IF('Bridge Quote'!$C3=\"\",\"\",'Bridge Quote'!$C3)","v":"<Complete>"}]
[7,"Security Address",{"$f":"OFFSET(C8,0,'Quote History'!$E$21+1)","v":"<Complete>"},{"$f":"IF('Bridge Quote'!$C5=\"\",\"\",'Bridge Quote'!$C5)","v":"<Complete>"}]
{"$rows_left_out":57}
{"sheet":"BTL Quote History","index":14,"n_rows":64,"n_cols":31,"rows_kept":64,"cut":false,"hidden":false,"merged":[]}
[null,{"$f":"A1-1","v":-1},{"$f":"MAX(C2:CK2)-1","v":0}]
[null,"Quote No","To retrieve",{"$f":"COUNTA(D9:$CA$9)","v":1},null,null,null,null,null,0,-1,-2,-3,-4,-5,-6,-7,-8,-9,-10,-8,-9,-9,-7,-8,-9,-8,-9,-8,-8,-8]
[2,"Date",null,"2026-02-24T11:58:08.370"]
[{"$f":"A3+1","v":3},"Different Quote",{"$f":"+IF(SUM(C7:C51,C64)=0,\"ERROR\",\"OK\")","v":"ERROR"},{"$f":"IF('BTL Workings'!$C$10=\"N\",\"N\",IF(D5<>E5,\"Y\",\"N\"))","v":"N"}]
[4,"Index",null,{"$f":"D9&\"-\"&D10&\"-\"&D11&\"-\"&D12&\"-\"&D13&\"-\"&D14&\"-\"&D15&\"-\"&D16&\"-\"&D17&\"-\"&D18&\"-\"&D19&\"-\"&D20&\"-\"&D21&\"-\"&D22&\"-\"&D23&\"-\"&D24&\"-\"&D25&\"-\"&D26&\"-\"&D27&\"-\"&D28&\"-\"&D29&\"-\"&D30&\"-\"&D31&\"-\"&D32&\"-\"&D33&\"-\"&D34&\"-\"&D35&\"-\"&D36&\"-\"&D37&\"-\"&D38&\"-\"&D39&\"-\"&D40&\"-\"&D41&\"-\"&D42&\"-\"&D43&\"-\"&D44&\"-\"&D45&\"-\"&D46&\"-\"&D47&\"-\"&D48&\"-\"&D49&\"-\"&D50&\"-\"&D51&D64","v":"<Select>-<Select>-<Select>-<Select>-<Select>-<Complete>-<Complete>-<Optional>-0-<Complete>-<Select>-<Select>-<Complete>-<Optional>-<Select>-<Select>-<Complete>-<Complete>-<Complete>-FALSE-FALSE-FALSE-FALSE-FALSE-FALSE-FALSE-<Select>-<Complete>-<Select>-<Select>-<Select>-<Select>-<Select>-<Select>-<Select>-<Complete>-<Optional>-<Complete>-<Complete>-<Complete>-<Optional>-<Optional>-<Optional>FALSE"}]
[5,"Short Plan",null,{"$f":"D9&\"-\"&D10&\"-\"&D11&\"-\"&D12&\"-\"&D13","v":"<Select>-<Select>-<Select>-<Select>-<Select>"}]
[6,"Applicant Name",{"$f":"OFFSET(C7,0,'Quote History'!$E$5+1)","v":"<Complete>"},{"$f":"IF('BTL Quote'!$C3=\"\",\"\",'BTL Quote'!$C3)","v":"<Complete>"}]
[7,"Security Address",{"$f":"OFFSET(C8,0,'Quote History'!$E$5+1)","v":"<Complete>"},{"$f":"IF('BTL Quote'!$C5=\"\",\"\",'BTL Quote'!$C5)","v":"<Complete>"}]
{"$rows_left_out":57}
{"sheet":"ONS","index":15,"n_rows":18,"n_cols":21,"rows_kept":18,"cut":false,"hidden":true,"merged":[]}
[]
[]
[]
[null,"ONS Figures"]
[null,"Updated 04.2025"]
[null,"Multiple","Factor",null,null,"Quintile",1,2,3,4,5,null,"Quintile Bands","from (y)","From (m)"]
[null,"1st adult",1,null,"1 adult","A26",1,1,1,1,1,null,1,0,null,1]
[null,"Ad adult",0.7,null,"2+ adult","A29",1.7,1.7,1.7,1.7,1.7,null,2,19760,{"$f":"N8/12","v":1646.6666666666667},2]
{"$rows_left_out":10}